0.219s:+ fetch -o orb.pkg 'https://builds.robur.coop/job/orb/build/latest/f/bin/orb.pkg?platform=freebsd-14'
3.454s:orb.pkg                                               3827 kB 1507 kBps    03s
3.454s:+ pkg install -y orb.pkg
3.454s:Updating poudriere repository catalogue...
3.454s:pkg: No SRV record found for the repo 'poudriere'
3.454s:poudriere repository is up to date.
3.454s:All repositories are up to date.
3.454s:The following 13 package(s) will be affected (of 0 checked):
3.454s:
3.454s:New packages to be INSTALLED:
3.454s:	bash: 5.2.37
3.454s:	curl: 8.11.1_1
3.454s:	expat: 2.6.4
3.454s:	gettext-runtime: 0.23.1
3.454s:	git: 2.47.1
3.454s:	gmake: 4.4.1
3.454s:	libidn2: 2.3.7
3.454s:	libnghttp2: 1.64.0
3.454s:	libpsl: 0.21.5_1
3.454s:	libunistring: 1.2
3.454s:	orb: 1.0.0.2.g8f912f3
3.454s:	patch: 2.7.6_2
3.454s:	readline: 8.2.13_2
3.454s:
3.454s:Number of packages to be installed: 13
3.454s:
3.454s:The process will require 61 MiB more space.
3.454s:10 MiB to be downloaded.
3.454s:[orba.orb] [1/13] Fetching libnghttp2-1.64.0.pkg: . done
3.454s:[orba.orb] [2/13] Fetching libidn2-2.3.7.pkg: .. done
3.507s:[orba.orb] [3/13] Fetching patch-2.7.6_2.pkg: . done
3.507s:[orba.orb] [4/13] Fetching gmake-4.4.1.pkg: .. done
3.507s:[orba.orb] [5/13] Fetching libunistring-1.2.pkg: .... done
3.507s:[orba.orb] [6/13] Fetching readline-8.2.13_2.pkg: ... done
3.562s:[orba.orb] [7/13] Fetching libpsl-0.21.5_1.pkg: . done
3.562s:[orba.orb] [8/13] Fetching curl-8.11.1_1.pkg: ......... done
3.622s:[orba.orb] [9/13] Fetching bash-5.2.37.pkg: .......... done
3.740s:[orba.orb] [10/13] Fetching gettext-runtime-0.23.1.pkg: .. done
3.740s:[orba.orb] [11/13] Fetching expat-2.6.4.pkg: . done
3.740s:[orba.orb] [12/13] Fetching git-2.47.1.pkg: .......... done
3.885s:Checking integrity... done (0 conflicting)
3.885s:[orba.orb] [13/13] Installing libunistring-1.2...
3.885s:[orba.orb] Extracting libunistring-1.2: .......... done
3.936s:[orba.orb] [1/13] Installing libidn2-2.3.7...
3.936s:[orba.orb] [1/13] Extracting libidn2-2.3.7: .......... done
3.974s:[orba.orb] [2/13] Installing libnghttp2-1.64.0...
3.974s:[orba.orb] [2/13] Extracting libnghttp2-1.64.0: .......... done
4.020s:[orba.orb] [3/13] Installing libpsl-0.21.5_1...
4.020s:[orba.orb] [3/13] Extracting libpsl-0.21.5_1: .......... done
4.055s:[orba.orb] [4/13] Installing readline-8.2.13_2...
4.055s:[orba.orb] [4/13] Extracting readline-8.2.13_2: .......... done
4.148s:[orba.orb] [5/13] Installing curl-8.11.1_1...
4.148s:[orba.orb] [5/13] Extracting curl-8.11.1_1: .......... done
4.346s:[orba.orb] [6/13] Installing gettext-runtime-0.23.1...
4.346s:[orba.orb] [6/13] Extracting gettext-runtime-0.23.1: .......... done
4.346s:[orba.orb] [7/13] Installing expat-2.6.4...
4.346s:[orba.orb] [7/13] Extracting expat-2.6.4: .......... done
4.346s:[orba.orb] [8/13] Installing patch-2.7.6_2...
4.346s:[orba.orb] [8/13] Extracting patch-2.7.6_2: ..... done
4.346s:[orba.orb] [9/13] Installing gmake-4.4.1...
4.346s:[orba.orb] [9/13] Extracting gmake-4.4.1: .......... done
4.346s:[orba.orb] [10/13] Installing bash-5.2.37...
4.395s:[orba.orb] [10/13] Extracting bash-5.2.37: .......... done
4.395s:[orba.orb] [11/13] Installing git-2.47.1...
4.395s:===> Creating groups
4.395s:Creating group 'git_daemon' with gid '964'
4.477s:===> Creating users
4.477s:Creating user 'git_daemon' with uid '964'
4.557s:[orba.orb] [11/13] Extracting git-2.47.1: .......... done
4.557s:[orba.orb] [12/13] Installing orb-1.0.0.2.g8f912f3...
5.094s:[orba.orb] [12/13] Extracting orb-1.0.0.2.g8f912f3: .. done
5.154s:=====
5.154s:Message from git-2.47.1:
5.154s:
5.154s:--
5.154s:If you installed the GITWEB option please follow these instructions:
5.154s:
5.154s:In the directory /usr/local/share/examples/git/gitweb you can find all files to
5.154s:make gitweb work as a public repository on the web.
5.154s:
5.154s:All you have to do to make gitweb work is:
5.154s:1) Please be sure you're able to execute CGI scripts in
5.154s:   /usr/local/share/examples/git/gitweb.
5.154s:2) Set the GITWEB_CONFIG variable in your webserver's config to
5.154s:   /usr/local/etc/git/gitweb.conf. This variable is passed to gitweb.cgi.
5.154s:3) Restart server.
5.154s:
5.154s:
5.154s:If you installed the CONTRIB option please note that the scripts are
5.154s:installed in /usr/local/share/git-core/contrib. Some of them require
5.154s:other ports to be installed (perl, python, etc), which you may need to
5.154s:install manually.
5.154s:+ rm orb.pkg
5.154s:+ repos=default:http://192.168.0.16,unikernels:git://git.robur.coop/robur/unikernel-repo.git
5.154s:+ orb build '--solver-timeout=600' '--switch-name=/tmp/myswitch' '--date=1589138087' '--out=.' '--repos=default:http://192.168.0.16,unikernels:git://git.robur.coop/robur/unikernel-repo.git' mirage-unikernel-opam-mirror-hvt
5.154s:[WARNING] /tmp exists and is not empty
5.154s:Proceed? [y/n] y
5.154s:
5.154s:<><> Fetching repository information ><><><><><><><><><><><><><><><><><><><><><>
5.154s:[empty] Initialised
5.154s:[ORB] using root "/tmp" and switch "myswitch"
5.918s:[unikernels] Initialised
7.584s:[default] Initialised
19.537s:[ORB] Switch myswitch created!
20.084s:[ORB] installing dependencies
20.084s:[ORB] Install start
20.361s:[ORB] Install mirage-unikernel-opam-mirror-hvt
28.606s:The following actions will be performed:
28.606s:=== install 39 packages
28.606s:  - install angstrom              0.16.1 [required by emile, uri]
28.606s:  - install astring               0.8.5  [required by mirage]
28.606s:  - install base-bigarray         base
28.606s:  - install base-threads          base   [required by dune]
28.606s:  - install base-unix             base   [required by bos, dune]
28.606s:  - install base64                3.5.1  [required by emile]
28.606s:  - install bigstringaf           0.10.0 [required by emile]
28.606s:  - install bos                   0.2.1  [required by mirage]
28.606s:  - install cmdliner              1.3.0  [required by mirage]
28.606s:  - install conf-pkg-config       4      [required by opam-monorepo]
28.606s:  - install conf-which            1      [required by ocaml-solo5]
28.607s:  - install csexp                 1.5.2  [required by dune-configurator]
28.607s:  - install domain-name           0.4.1  [required by ipaddr]
28.607s:  - install dune                  3.17.2 [required by mirage]
28.607s:  - install dune-configurator     3.17.2 [required by bigstringaf]
28.607s:  - install emile                 1.1    [required by mirage]
28.607s:  - install fmt                   0.10.0 [required by mirage]
28.607s:  - install fpath                 0.7.3  [required by mirage]
28.607s:  - install ipaddr                5.6.0  [required by mirage]
28.607s:  - install logs                  0.7.0  [required by mirage]
28.607s:  - install macaddr               5.6.0  [required by ipaddr]
28.607s:  - install mirage                4.8.2  [required by mirage-unikernel-opam-mirror-hvt]
28.607s:  - install ocaml                 4.14.2 [required by mirage, ocaml-solo5]
28.607s:  - install ocaml-base-compiler   4.14.2 [required by ocaml]
28.607s:  - install ocaml-config          2      [required by ocaml]
28.607s:  - install ocaml-options-vanilla 1
28.607s:  - install ocaml-solo5           0.8.5  [required by mirage-unikernel-opam-mirror-hvt]
28.607s:  - install ocaml-src             4.14.2 [required by ocaml-solo5]
28.607s:  - install ocaml-syntax-shims    1.0.0  [required by angstrom]
28.607s:  - install ocamlbuild            0.16.1 [required by astring, bos]
28.607s:  - install ocamlfind             1.9.8  [required by ocaml-solo5]
28.607s:  - install opam-monorepo         0.4.1  [required by mirage-unikernel-opam-mirror-hvt]
28.607s:  - install pecu                  0.7    [required by emile]
28.607s:  - install rresult               0.7.0  [required by mirage]
28.607s:  - install solo5                 0.9.1  [required by mirage-unikernel-opam-mirror-hvt]
28.607s:  - install stringext             1.6.0  [required by uri]
28.607s:  - install topkg                 1.0.8  [required by astring, bos]
28.607s:  - install uri                   4.4.0  [required by mirage]
28.607s:  - install uutf                  1.0.4  [required by emile]
28.607s:
28.607s:The following system packages will first need to be installed:
28.607s:    pkgconf
28.607s:
28.607s:<><> Handling external dependencies <><><><><><><><><><><><><><><><><><><><><><>
28.607s:
28.607s:opam believes some required external dependencies are missing. opam can:
28.607s:> 1. Run pkg to install them (may need root/sudo access)
28.607s:  2. Display the recommended pkg command and wait while you run it manually (e.g. in another terminal)
28.607s:  3. Continue anyway, and, upon success, permanently register that this external dependency is present, but not detectable
28.607s:  4. Abort the installation
28.607s:
28.607s:[1/2/3/4] 1
28.607s:
28.607s:+ /usr/local/sbin/pkg "install" "-y" "pkgconf"
28.729s:- Updating poudriere repository catalogue...
28.729s:- pkg: No SRV record found for the repo 'poudriere'
28.729s:- poudriere repository is up to date.
28.729s:- All repositories are up to date.
28.729s:- The following 1 package(s) will be affected (of 0 checked):
28.729s:- 
28.729s:- New packages to be INSTALLED:
28.729s:- 	pkgconf: 2.3.0,1
28.729s:- 
28.729s:- Number of packages to be installed: 1
28.729s:- 
28.729s:- 83 KiB to be downloaded.
28.729s:- [orba.orb] [1/1] Fetching pkgconf-2.3.0,1.pkg: . done
28.729s:- Checking integrity... done (0 conflicting)
28.729s:- [orba.orb] [1/1] Installing pkgconf-2.3.0,1...
28.729s:- [orba.orb] [1/1] Extracting pkgconf-2.3.0,1: .......... done
28.729s:
28.729s:<><> Processing actions <><><><><><><><><><><><><><><><><><><><><><><><><><><><>
28.729s:-> installed base-bigarray.base
28.729s:-> installed base-threads.base
28.729s:-> installed base-unix.base
28.729s:-> retrieved base64.3.5.1  (http://192.168.0.16/cache)
28.729s:-> retrieved astring.0.8.5  (http://192.168.0.16/cache)
28.729s:-> retrieved angstrom.0.16.1  (http://192.168.0.16/cache)
28.729s:-> retrieved bigstringaf.0.10.0  (http://192.168.0.16/cache)
28.729s:-> installed conf-pkg-config.4
28.729s:-> installed conf-which.1
28.768s:-> retrieved csexp.1.5.2  (http://192.168.0.16/cache)
28.768s:-> retrieved domain-name.0.4.1  (http://192.168.0.16/cache)
28.768s:-> retrieved bos.0.2.1  (http://192.168.0.16/cache)
28.811s:-> retrieved cmdliner.1.3.0  (http://192.168.0.16/cache)
28.811s:-> retrieved emile.1.1  (http://192.168.0.16/cache)
28.811s:-> retrieved fmt.0.10.0  (http://192.168.0.16/cache)
28.912s:-> retrieved fpath.0.7.3  (http://192.168.0.16/cache)
28.912s:-> retrieved logs.0.7.0  (http://192.168.0.16/cache)
28.964s:-> retrieved ipaddr.5.6.0, macaddr.5.6.0  (http://192.168.0.16/cache)
29.186s:-> retrieved mirage.4.8.2  (http://192.168.0.16/cache)
29.224s:-> retrieved ocaml-config.2  (2 extra sources)
29.224s:-> retrieved ocaml-config.2  (2 extra sources)
29.224s:-> installed ocaml-options-vanilla.1
29.691s:-> retrieved ocaml-solo5.0.8.5  (http://192.168.0.16/cache)
29.691s:-> retrieved ocaml-syntax-shims.1.0.0  (http://192.168.0.16/cache)
29.781s:-> retrieved ocamlbuild.0.16.1  (http://192.168.0.16/cache)
29.859s:-> retrieved ocamlfind.1.9.8  (http://192.168.0.16/cache)
34.058s:-> retrieved ocaml-base-compiler.4.14.2, ocaml-src.4.14.2  (http://192.168.0.16/cache)
42.934s:-> retrieved dune.3.17.2, dune-configurator.3.17.2  (http://192.168.0.16/cache)
42.934s:-> retrieved pecu.0.7  (http://192.168.0.16/cache)
46.244s:-> retrieved opam-monorepo.0.4.1  (http://192.168.0.16/cache)
46.244s:-> retrieved rresult.0.7.0  (http://192.168.0.16/cache)
46.244s:-> retrieved stringext.1.6.0  (http://192.168.0.16/cache)
46.333s:-> retrieved solo5.0.9.1  (http://192.168.0.16/cache)
46.424s:-> retrieved uri.4.4.0  (http://192.168.0.16/cache)
46.464s:-> retrieved topkg.1.0.8  (http://192.168.0.16/cache)
46.464s:-> retrieved uutf.1.0.4  (http://192.168.0.16/cache)
75.148s:-> installed solo5.0.9.1
183.914s:-> installed ocaml-base-compiler.4.14.2
183.914s:-> installed ocaml-config.2
184.029s:-> installed ocaml.4.14.2
189.594s:-> installed ocaml-src.4.14.2
189.875s:-> installed cmdliner.1.3.0
193.304s:-> installed ocamlfind.1.9.8
196.914s:-> installed ocamlbuild.0.16.1
204.004s:-> installed topkg.1.0.8
205.314s:-> installed rresult.0.7.0
205.924s:-> installed uutf.1.0.4
206.344s:-> installed fmt.0.10.0
207.073s:-> installed astring.0.8.5
208.124s:-> installed fpath.0.7.3
208.124s:-> installed logs.0.7.0
211.534s:-> installed bos.0.2.1
220.594s:-> installed dune.3.17.2
223.974s:-> installed ocaml-syntax-shims.1.0.0
223.974s:-> installed macaddr.5.6.0
223.974s:-> installed domain-name.0.4.1
224.014s:-> installed csexp.1.5.2
228.174s:-> installed ipaddr.5.6.0
228.234s:-> installed stringext.1.6.0
228.274s:-> installed pecu.0.7
228.274s:-> installed base64.3.5.1
232.314s:-> installed dune-configurator.3.17.2
234.014s:-> installed bigstringaf.0.10.0
235.424s:-> installed angstrom.0.16.1
236.404s:-> installed emile.1.1
238.220s:-> installed uri.4.4.0
260.694s:-> installed opam-monorepo.0.4.1
264.689s:-> installed mirage.4.8.2
278.189s:-> installed ocaml-solo5.0.8.5
280.980s:Done.
280.980s:# To update the current shell environment, run: eval $(opam env --switch=myswitch)
280.980s:[ORB] Installed mirage-unikernel-opam-mirror-hvt
280.980s:[ORB] installed dependencies
281.506s:-> retrieved mirage-unikernel-opam-mirror-hvt.0.0.1  (git+https://git.robur.coop/robur/opam-mirror.git)
282.344s:[mirage-overlays] Initialised
282.399s:[opam-overlays] Initialised
283.448s:# To update the current shell environment, run: eval $(opam env)
283.448s:+ cd mirage/
283.448s:+ mirage configure -t hvt --context ./mirage/context --no-extra-repo
285.011s:Successfully configured the unikernel. Now run 'make' (or more fine-grained steps: 'make all', 'make depends', or 'make lock').
285.011s:gmake: Entering directory '/tmp/orb-build/mirage'
285.011s:gmake[1]: Entering directory '/tmp/orb-build/mirage'
285.011s: ↳ generate lockfile for monorepo dependencies
285.011s:==> Using 1 locally scanned package as the target.
289.469s:==> Found 138 opam dependencies for the target package.
289.469s:==> Querying opam database for their metadata and Dune compatibility.
289.469s:==> Calculating exact pins for each of them.
289.469s:==> Wrote lockfile with 96 entries to mirage/mirror-hvt.opam.locked. You can now run opam monorepo pull to fetch their sources.
289.469s:gmake[1]: Leaving directory '/tmp/orb-build/mirage'
289.469s:The lock file has been generated. Run 'make pull' to retrieve the sources, or 'make install-switch' to install the host dependencies.
289.469s:echo " ↳ install external dependencies for monorepo"
289.525s: ↳ install external dependencies for monorepo
289.525s:env OPAMVAR_monorepo="opam-monorepo" opam monorepo depext -y -l mirage/mirror-hvt.opam.locked
289.525s:==> Using lockfile mirage/mirror-hvt.opam.locked
289.525s: ↳ fetch monorepo dependencies in the duniverse folder
289.525s:==> Using lockfile mirage/mirror-hvt.opam.locked
315.185s:Successfully pulled 96/96 repositories
315.185s:The sources have been pulled to the duniverse folder. Run 'make build' to build the unikernel.
315.185s:gmake: Leaving directory '/tmp/orb-build/mirage'
315.668s:[ORB] now building mirage-unikernel-opam-mirror-hvt.0.0.1
400.893s:[ERROR] The compilation of mirage-unikernel-opam-mirror-hvt.0.0.1 failed at "gmake -Cmirage/ build".
400.893s:
400.893s:#=== ERROR while compiling mirage-unikernel-opam-mirror-hvt.0.0.1 =============#
400.893s:# context              2.3.0 | freebsd/x86_64 |  | git://git.robur.coop/robur/unikernel-repo.git
400.893s:# path                 /tmp/orb-build
400.893s:# command              /usr/local/bin/gmake -Cmirage/ build
400.893s:# exit-code            2
400.893s:# env-file             /tmp/opam-root-61956/mirage-unikernel-opam-mirror-hvt-61956-b42744.env
400.893s:# output-file          /tmp/opam-root-61956/mirage-unikernel-opam-mirror-hvt-61956-b42744.out
400.893s:### output ###
400.893s:# gmake: Entering directory '/tmp/orb-build/mirage'
400.893s:# dune build --profile release --root . ./dist
400.893s:# gmake[1]: Entering directory '/tmp/orb-build/mirage/_build/solo5/duniverse/mirage-solo5/lib/bindings'
400.893s:# ocamlfind -toolchain solo5 ocamlopt    -c -o clock_stubs.o clock_stubs.c
400.893s:# ocamlfind -toolchain solo5 ocamlopt    -c -o mm_stubs.o mm_stubs.c
400.893s:# ocamlfind -toolchain solo5 ocamlopt    -c -o main.o main.c
400.893s:# ar r libmirage-solo5_bindings.a clock_stubs.o mm_stubs.o main.o
400.893s:# gmake[1]: Leaving directory '/tmp/orb-build/mirage/_build/solo5/duniverse/mirage-solo5/lib/bindings'
400.893s:# ar: warning: creating libmirage-solo5_bindings.a
400.893s:# native/adler32.c:28:7: warning: a function definition without a prototype is deprecated in all versions of C and is not supported in C23 [-Wdeprecated-non-prototype]
400.893s:#    28 | uLong _adler32(adler, buf, len)
400.893s:#       |       ^
400.893s:# native/adler32.c:100:7: warning: a function definition without a prototype is deprecated in all versions of C and is not supported in C23 [-Wdeprecated-non-prototype]
400.893s:#   100 | uLong checkseum_adler32_digest(adler, buf, len)
400.893s:#       |       ^
400.893s:# 2 warnings generated.
400.893s:# binary ocaml: found in /tmp/myswitch/bin
400.893s:# binary ocamlc: found in /tmp/myswitch/bin
400.893s:# binary ocamldep: found in /tmp/myswitch/bin
400.893s:# binary ocamlmklib: found in /tmp/myswitch/bin
400.893s:# binary ocamldoc: found in /tmp/myswitch/bin
400.893s:# binary cc: found in /usr/bin
400.893s:# binary ocamlopt: found in /tmp/myswitch/bin
400.893s:# checking compilation with  -I/tmp/orb-build/mirage/_build/default/duniverse/Zarith/../../../install/default/lib/gmp/: working
400.893s:# include caml/mlvalues.h: found
400.893s:# library dynlink.cmxa: found
400.893s:# binary ocamlfind: found in /tmp/myswitch/bin
400.893s:# OCaml's word size is 64
400.893s:# package gmp: found
400.893s:# OCaml supports -bin-annot to produce documentation
400.893s:# 
400.893s:# detected configuration:
400.893s:# 
400.893s:#   native-code:          yes
400.893s:#   dynamic linking:      yes
400.893s:#   defines:              -DHAS_GMP 
400.893s:#   includes:             -I/tmp/myswitch/lib/ocaml -I/tmp/orb-build/mirage/_build/default/duniverse/Zarith/../../../install/default/lib/gmp/ -I/usr/local/include
400.893s:#   libraries:             -L/usr/local/lib -lgmp
400.893s:#   linker options:       -L/tmp/orb-build/mirage/_build/default/duniverse/Zarith/../../../install/default/lib/gmp/
400.893s:#   C options:            -I/tmp/orb-build/mirage/_build/default/duniverse/Zarith/../../../install/default/lib/gmp/
400.893s:#   installation path:    /tmp/myswitch/lib
400.893s:#   installation method   findlib
400.893s:# 
400.893s:# configuration successful!
400.893s:# now type "make" to build
400.893s:# then type "make install" or "sudo make install" to install
400.893s:# configure: WARNING: using cross tools not prefixed with host triplet
400.893s:# configure: WARNING: cannot check for properly working vsnprintf when cross compiling, will assume it's ok
400.893s:# binary ocaml: found in /tmp/myswitch/bin
400.893s:# binary ocamlc: found in /tmp/myswitch/bin
400.893s:# binary ocamldep: found in /tmp/myswitch/bin
400.893s:# binary ocamlmklib: found in /tmp/myswitch/bin
400.893s:# binary ocamldoc: found in /tmp/myswitch/bin
400.893s:# binary x86_64-solo5-none-static-cc: found in /tmp/myswitch/bin
400.893s:# binary ocamlopt: found in /tmp/myswitch/bin
400.893s:# checking compilation with  -I/tmp/orb-build/mirage/_build/solo5/duniverse/Zarith/../../../install/solo5/lib/gmp/: working
400.893s:# include caml/mlvalues.h: found
400.893s:# library dynlink.cmxa: found
400.893s:# binary ocamlfind: found in /tmp/myswitch/bin
400.893s:# OCaml's word size is 64
400.893s:# package gmp: found
400.893s:# OCaml supports -bin-annot to produce documentation
400.893s:# 
400.893s:# detected configuration:
400.893s:# 
400.893s:#   native-code:          yes
400.893s:#   dynamic linking:      yes
400.893s:#   defines:              -DHAS_GMP 
400.893s:#   includes:             -I/tmp/myswitch/solo5-sysroot/lib/ocaml -I/tmp/orb-build/mirage/_build/solo5/duniverse/Zarith/../../../install/solo5/lib/gmp/ -I/usr/local/include
400.893s:#   libraries:             -L/usr/local/lib -lgmp
400.893s:#   linker options:       -L/tmp/orb-build/mirage/_build/solo5/duniverse/Zarith/../../../install/solo5/lib/gmp/
400.893s:#   C options:            -I/tmp/orb-build/mirage/_build/solo5/duniverse/Zarith/../../../install/solo5/lib/gmp/
400.893s:#   installation path:    /tmp/myswitch/lib
400.893s:#   installation method   findlib
400.893s:# 
400.893s:# configuration successful!
400.893s:# now type "make" to build
400.893s:# then type "make install" or "sudo make install" to install
400.893s:# extract-from-certdata: [WARNING] Untrusted certificate "Explicitly Distrust DigiNotar Root CA" (serial 02100fffffffffffffffffffffffffffffff)
400.893s:# Context: solo5
400.893s:# File "unikernel.ml", line 97, characters 14-49:
400.893s:# 97 |   module KV = Tar_mirage.Make_KV_RW(Pclock)(Part)
400.893s:#                    ^^^^^^^^^^^^^^^^^^^^^^^^^^^^^^^^^^^
400.893s:# Error: The functor application is ill-typed.
400.893s:#        These arguments:
400.893s:#          Pclock Part
400.893s:#        do not match these parameters:
400.893s:#          functor (BLOCK : Mirage_block.S) -> ...
400.893s:#        1. The following extra argument is provided
400.893s:#               Pclock :
400.893s:#               sig
400.893s:#                 val now_d_ps : unit -> int * int64
400.893s:#                 val current_tz_offset_s : unit -> int option
400.893s:#                 val period_d_ps : unit -> (int * int64) option
400.893s:#               end
400.893s:#        2. Modules do not match:
400.893s:#             Part :
400.893s:#             sig
400.893s:#               module Part = Part.Part
400.893s:#               type nonrec error = Mirage_block_partition.Make(BLOCK).error
400.893s:#               val pp_error : error Fmt.t
400.893s:#               type nonrec write_error =
400.893s:#                   Mirage_block_partition.Make(BLOCK).write_error
400.893s:#               val pp_write_error : write_error Fmt.t
400.893s:#               type t = Mirage_block_partition.Make(BLOCK).t
400.893s:#               val disconnect : t -> unit Lwt.t
400.893s:#               val get_info : t -> Mirage_block.info Lwt.t
400.893s:#               val read :
400.893s:#                 t -> int64 -> Cstruct.t list -> (unit, error) result Lwt.t
400.893s:#               val write :
400.893s:#                 t ->
400.893s:#                 int64 -> Cstruct.t list -> (unit, write_error) result Lwt.t
400.893s:#               val subpartition : int64 -> t -> t * t
400.893s:#               val get_offset : t -> int64
400.893s:#               type partitions =
400.893s:#                 Dune__exe__Partitions.Make(BLOCK).partitions = {
400.893s:#                 tar : Part.t;
400.893s:#                 swap : Part.t;
400.893s:#                 git_dump : Part.t;
400.893s:#                 md5s : Part.t;
400.893s:#                 sha512s : Part.t;
400.893s:#               }
400.893s:#               val swap_guid : Uuidm.t
400.893s:#               val tar_guid : Uuidm.t
400.893s:#               val cache_guid : Uuidm.t
400.893s:#               val git_guid : Uuidm.t
400.893s:#               val utf16be_of_ascii : string -> string
400.893s:#               val read_partition_table :
400.893s:#                 Mirage_block.info -> BLOCK.t -> Gpt.t Lwt.t
400.893s:#               val connect : BLOCK.t -> partitions Lwt.t
400.893s:#               val format :
400.893s:#                 BLOCK.t ->
400.893s:#                 cache_size:int ->
400.893s:#                 git_size:int ->
400.893s:#                 swap_size:int ->
400.893s:#                 (unit, [> `Block of BLOCK.write_error | `Msg of string ])
400.893s:#                 result Lwt.t
400.893s:#             end
400.893s:#           is not included in
400.893s:#             Mirage_block.S
400.893s:#           Type declarations do not match:
400.893s:#             type error = Mirage_block_partition.Make(BLOCK).error
400.893s:#           is not included in
400.894s:#             type error = private [> Mirage_block.error ]
400.894s:#           The type Mirage_block_partition.Make(BLOCK).error
400.894s:#           is not equal to the type [> Mirage_block.error ]
400.894s:#           Mirage_block_partition.Make(BLOCK).error is abstract because no corresponding cmi file was found in path.
400.894s:#           File "duniverse/mirage-block/src/mirage_block.mli", line 49, characters 2-40:
400.894s:#             Expected declaration
400.894s:#           File "duniverse/mirage-block/src/mirage_block.mli", line 49, characters 2-40:
400.894s:#             Actual declaration
400.894s:# gmake: *** [Makefile:46: build] Error 1
400.894s:# gmake: Leaving directory '/tmp/orb-build/mirage'
400.894s:
400.894s:[ORB] failed to build package mirage-unikernel-opam-mirror-hvt.0.0.1: "/usr/local/bin/gmake -Cmirage/ build" exited with code 2 "Error: The functor application is ill-typed."
401.962s:[ORB] cleaning up
403.824s:[ORB] Switch myswitch removed